Autore Topic: Ancora con Amule Adunanza. (RISOLTO)  (Letto 5816 volte)

Offline burnosauri

  • *
  • Post: 118
  • Reputazione: 0
    • Mostra profilo
Ancora con Amule Adunanza. (RISOLTO)
« il: 21 Maggio 2012 ore 17:14 »
Salve a tutti,
ho avuto l'idea di scaricare la nuova Archimedes dvd, 2012-05, tutto ok con "pacman",solo che col solito comando:
Citazione
ccr -S amule-adnza
mi si è ripresentata la stessa impasse per la quale chiesi aiuto nel dicembre scorso:
http://forum.chakra-project.it/index.php/topic,2933.0.html

In pratica lunga compilazione, ma in fondo "build failed".
C'è qualche novità in proposito? Grazie a tutti.
« Ultima modifica: 21 Maggio 2012 ore 21:33 da burnosauri »

Offline Hombremaledicto

  • *
  • Post: 520
  • Reputazione: 40
  • Ma chi ti si incula
    • Mostra profilo
    • Hombre on DA
Re:Ancora con Amule Adunanza.
« Risposta #1 il: 21 Maggio 2012 ore 17:52 »
Ciao, anche io ho reinstallato di recente, e ho avuto errore.
Prova a vedere se trovi utile la discussione che ho aperto, controlla se l'output del terminale è lo stesso (in fondo c'è una soluzione al problema che avevo incontrato) :

http://forum.chakra-project.it/index.php/topic,3868.0.html
« Ultima modifica: 21 Maggio 2012 ore 17:55 da Spleen »
Keep it rolling, baby...

Offline Hombremaledicto

  • *
  • Post: 520
  • Reputazione: 40
  • Ma chi ti si incula
    • Mostra profilo
    • Hombre on DA
Re:Ancora con Amule Adunanza.
« Risposta #2 il: 21 Maggio 2012 ore 17:53 »

Se riesci posta comunque l'errore :)
« Ultima modifica: 21 Maggio 2012 ore 17:56 da Spleen »
Keep it rolling, baby...

Offline burnosauri

  • *
  • Post: 118
  • Reputazione: 0
    • Mostra profilo
Re:Ancora con Amule Adunanza.
« Risposta #3 il: 21 Maggio 2012 ore 18:10 »
si, non appena posso, posto la parte finale dell'installazione. anche a dicembre, c'era di mezzo il "pacchetto crypto++", però riuscirono a risolvermelo, gli amici di chakra, come si vede nel post che ho linkato.

Offline Hombremaledicto

  • *
  • Post: 520
  • Reputazione: 40
  • Ma chi ti si incula
    • Mostra profilo
    • Hombre on DA
Re:Ancora con Amule Adunanza.
« Risposta #4 il: 21 Maggio 2012 ore 18:21 »
Se si tratta ancora di crypto++ potresti reinstallare la patch caricata da jmc.
Keep it rolling, baby...

Offline burnosauri

  • *
  • Post: 118
  • Reputazione: 0
    • Mostra profilo
Re:Ancora con Amule Adunanza.
« Risposta #5 il: 21 Maggio 2012 ore 18:44 »
Ecco l'errore:
Citazione
Compiling amule.cpp
Compiling BaseClient.cpp
Compiling ClientList.cpp
Compiling ClientCreditsList.cpp
Compiling ClientTCPSocket.cpp
Compiling ClientUDPSocket.cpp
Compiling DownloadClient.cpp
Compiling DownloadQueue.cpp
In file included from DownloadQueue.h:30:0,
                 from DownloadQueue.cpp:26:
ObservableQueue.h: In instantiation of ‘void CObservableQueue<ValueType>::ObserverAdded(CObservableQueue<ValueType>::ObserverType*) [with ValueType = CPartFile*; CObservableQueue<ValueType>::ObserverType = CObserver<CQueueEvent<CPartFile*> >]’:
DownloadQueue.cpp:1597:32:   required from here
ObservableQueue.h:334:2: error: ‘NotifyObservers’ was not declared in this scope, and no declarations were found by argument-dependent lookup at the point of instantiation [-fpermissive]
ObservableQueue.h:334:2: note: declarations in dependent base ‘CObservable<CQueueEvent<CPartFile*> >’ are not found by unqualified lookup
ObservableQueue.h:334:2: note: use ‘this->NotifyObservers’ instead
ObservableQueue.h: In instantiation of ‘void CObservableQueue<ValueType>::ObserverRemoved(CObservableQueue<ValueType>::ObserverType*) [with ValueType = CPartFile*; CObservableQueue<ValueType>::ObserverType = CObserver<CQueueEvent<CPartFile*> >]’:
DownloadQueue.cpp:1753:1:   required from here
ObservableQueue.h:341:2: error: ‘NotifyObservers’ was not declared in this scope, and no declarations were found by argument-dependent lookup at the point of instantiation [-fpermissive]
ObservableQueue.h:341:2: note: declarations in dependent base ‘CObservable<CQueueEvent<CPartFile*> >’ are not found by unqualified lookup
ObservableQueue.h:341:2: note: use ‘this->NotifyObservers’ instead
make[3]: *** [amule-DownloadQueue.o] Errore 1
make[2]: *** [all-recursive] Errore 1
make[1]: *** [all-recursive] Errore 1
make: *** [all] Errore 2
==> ERRORE: Si è verificato un errore in build().
    L'operazione sta per essere interrotta...
The build failed.
[burno@burno-pc ~]$

                                                   

Offline Hombremaledicto

  • *
  • Post: 520
  • Reputazione: 40
  • Ma chi ti si incula
    • Mostra profilo
    • Hombre on DA
Re:Ancora con Amule Adunanza.
« Risposta #6 il: 21 Maggio 2012 ore 19:21 »
Lo stesso errore che avevo dopo aver installato la patch!
In questa discussione trovi un file archivio contenente una patch a gcc e un pkgbuild: http://www.archlinux.it/forum/viewtopic.php?f=18&t=14293

Dai nuovamente il comando ccr -S amule-adnza( ma lascia in sospeso l'installazione, quando ti chiede se vuoi editare il pacchetto non scrivere nulla) quindi spostati nella cartella /tmp e cerca i file di amule appena creati, copiaci dentro il contenuto dell'archivio sovrascrivendo i file. Quindi dai il comando makepkg (apri il terminale nella directory del pacchetto).
Poi puoi installare il pacchetto appena creato con sudo pacman -U nome_del_file
« Ultima modifica: 21 Maggio 2012 ore 19:24 da Spleen »
Keep it rolling, baby...

Offline burnosauri

  • *
  • Post: 118
  • Reputazione: 0
    • Mostra profilo
Re:Ancora con Amule Adunanza.
« Risposta #7 il: 21 Maggio 2012 ore 19:37 »
allora:
1-scarico il file "compilazione adnza.zip"
2-l'ho estratto in Home ed è un file di testo, e li rimane
3-parto con "ccr -S amule-adnza" e mi fermo quando? a quale file mi devo fermare?
4- mi sposto in "radice _temp" e li trovo una cartella che si chiama?
5-dove (in che file) va sovrascritto il file di cui sopra, aperto con Kate?
6-a questo punto, se ho il terminale fermo sulla scritta gialla, alla quale mi hai detto di fermarmi, come faccio a dare il comando makepkg? (non ricordo più i due tasti per fare apparire il terminale nella finestra)
7- questo pacchetto creato lo troverò , dove?

mi scuso enormemente , per la prolissità, ma se non faccio così non ci riesco.grazie

Offline Hombremaledicto

  • *
  • Post: 520
  • Reputazione: 40
  • Ma chi ti si incula
    • Mostra profilo
    • Hombre on DA
Re:Ancora con Amule Adunanza.
« Risposta #8 il: 21 Maggio 2012 ore 19:50 »
allora:
1-scarico il file "compilazione adnza.zip"
2-l'ho estratto in Home ed è un file di testo, e li rimane
3-parto con "ccr -S amule-adnza" e mi fermo quando? a quale file mi devo fermare?
4- mi sposto in "radice _temp" e li trovo una cartella che si chiama?
5-dove (in che file) va sovrascritto il file di cui sopra, aperto con Kate?
6-a questo punto, se ho il terminale fermo sulla scritta gialla, alla quale mi hai detto di fermarmi, come faccio a dare il comando makepkg? (non ricordo più i due tasti per fare apparire il terminale nella finestra)
7- questo pacchetto creato lo troverò , dove?

mi scuso enormemente , per la prolissità, ma se non faccio così non ci riesco.grazie

Tranquillo :D Dovrebbero essere 2 i file ???
Il file da scaricare è questo: http://www.archlinux.it/forum/download/file.php?id=7 quello che hai è un errore che ha postato un utente nella discussione!
Dopo il comando ccr -S amule-adnza e aver confermato l'installazione dovrebbe chiederti se vuoi editare il pkgbuild, lì lasci in sospeso il processo (se confermi e prosegue, fallendo nuovamente l'installazione il file in tmp scompare)
La cartella dovrebbe trovarsi in /tmp/ccrtemp1000/
Puoi dare il comando makepkg aprendo una nuova scheda nel terminale, o avviandone uno nuovo (ricorda di spostarti col comando 'cd' nella directory).
I file basta che li copi nella cartella amule-adnza che comparirà in /tmp/ccrtemp1000/ e sovrascrivi se ti chiede.
Il pacchetto dovrebbe risultare nella stessa cartella dove hai dato il comando.

Scusami, mi sono spiegato male prima. :P

« Ultima modifica: 21 Maggio 2012 ore 19:58 da Spleen »
Keep it rolling, baby...

Offline burnosauri

  • *
  • Post: 118
  • Reputazione: 0
    • Mostra profilo
Re:Ancora con Amule Adunanza.
« Risposta #9 il: 21 Maggio 2012 ore 19:54 »
i due file sono nell'ultimo link che mi hai mandato, vero?
quello :"compilazione adnza.zip", non serve a niente. me lo confermi?
passo alla prova.

Offline Hombremaledicto

  • *
  • Post: 520
  • Reputazione: 40
  • Ma chi ti si incula
    • Mostra profilo
    • Hombre on DA
Re:Ancora con Amule Adunanza.
« Risposta #10 il: 21 Maggio 2012 ore 20:00 »
i due file sono nell'ultimo link che mi hai mandato, vero?
quello :"compilazione adnza.zip", non serve a niente. me lo confermi?
passo alla prova.

Esatto! Buona fortuna ;)
Keep it rolling, baby...

Offline burnosauri

  • *
  • Post: 118
  • Reputazione: 0
    • Mostra profilo
Re:Ancora con Amule Adunanza.
« Risposta #11 il: 21 Maggio 2012 ore 20:04 »
prima ho spostato i due file nella cartella, epoi se do il comando , mi da:
Citazione
[burno@burno-pc ccrtmp-1000]$ makepkg
==> ERRORE: PKGBUILD non esiste.
[burno@burno-pc ccrtmp-1000]$ file:///tmp/ccrtmp-1000/PKGBUILD
bash: file:///tmp/ccrtmp-1000/PKGBUILD: File o directory non esistente
[burno@burno-pc ccrtmp-1000]$ file:///tmp/ccrtmp-1000/gcc-4.7.patch
bash: file:///tmp/ccrtmp-1000/gcc-4.7.patch: File o directory non esistente
[burno@burno-pc ccrtmp-1000]$
sbaglio qualcosa, mi sa.

Offline burnosauri

  • *
  • Post: 118
  • Reputazione: 0
    • Mostra profilo
Re:Ancora con Amule Adunanza.
« Risposta #12 il: 21 Maggio 2012 ore 20:06 »
riprovando, con i due file incollati li:
Citazione
[burno@burno-pc ccrtmp-1000]$ [burno@burno-pc ccrtmp-1000]$ makepkg
bash: [burno@burno-pc: command not found
[burno@burno-pc ccrtmp-1000]$ ==> ERRORE: PKGBUILD non esiste.
bash: ==: command not found
[burno@burno-pc ccrtmp-1000]$ [burno@burno-pc ccrtmp-1000]$ file:///tmp/ccrtmp-1000/PKGBUILD
bash: [burno@burno-pc: command not found
[burno@burno-pc ccrtmp-1000]$ bash: file:///tmp/ccrtmp-1000/PKGBUILD: File o directory non esistente
bash: bash:: command not found
[burno@burno-pc ccrtmp-1000]$ [burno@burno-pc ccrtmp-1000]$ file:///tmp/ccrtmp-1000/gcc-4.7.patch
bash: [burno@burno-pc: command not found
[burno@burno-pc ccrtmp-1000]$ bash: file:///tmp/ccrtmp-1000/gcc-4.7.patch: File o directory non esistente
bash: bash:: command not found
[burno@burno-pc ccrtmp-1000]$ [burno@burno-pc ccrtmp-1000]$
bash: [burno@burno-pc: command not found
[burno@burno-pc ccrtmp-1000]$

Offline Hombremaledicto

  • *
  • Post: 520
  • Reputazione: 40
  • Ma chi ti si incula
    • Mostra profilo
    • Hombre on DA
Re:Ancora con Amule Adunanza.
« Risposta #13 il: 21 Maggio 2012 ore 20:11 »
Ho sbagliato io scusa  >:(
La cartella  dove devi operare e copiare i file è /tmp/ccrbuild-1000/amule-adnza/amule-adnza

Dovrebbero essere presenti altri file al suo interno oltre al PKGBUILD, tra cui wxfont.patch e svn_fixes.patch

Scusami(ho dormito solo 2 ore in 2 giorni) , riprova e dimmi :)
« Ultima modifica: 21 Maggio 2012 ore 20:33 da Spleen »
Keep it rolling, baby...

Offline burnosauri

  • *
  • Post: 118
  • Reputazione: 0
    • Mostra profilo
Re:Ancora con Amule Adunanza.
« Risposta #14 il: 21 Maggio 2012 ore 21:00 »
ora makepkg, sta funzionando: dopo con l'installazione lasiata a mezzo, cosa devo fare?

 

Template by Homey | Sito ufficiale | Disclaimer