Autore Topic: Impossibile installare Wxpython  (Letto 1072 volte)

Offline -luk-

  • *
  • Post: 59
  • Reputazione: 0
    • Mostra profilo
Impossibile installare Wxpython
« il: 11 Marzo 2012 ore 14:57 »
Salve ragazzi non riesco ad installare wxpython da CCR.
Ricevo questo errore
Codice: [Seleziona]
In file included from contrib/glcanvas/gtk/glcanvas_wrap.cpp:2658:0:
include/wx/wxPython/wxPython.h: In function ‘bool wxPyCoreAPI_IMPORT()’:
include/wx/wxPython/wxPython.h:39:80: warning: deprecated conversion from string constant to ‘char*’ [-Wwrite-strings]
include/wx/wxPython/wxPython.h:39:80: warning: deprecated conversion from string constant to ‘char*’ [-Wwrite-strings]
contrib/glcanvas/gtk/glcanvas_wrap.cpp: In function ‘PyObject* _wrap_new_GLContext(PyObject*, PyObject*, PyObject*)’:
contrib/glcanvas/gtk/glcanvas_wrap.cpp:2740:3: error: ‘wxGLCanvas’ was not declared in this scope
contrib/glcanvas/gtk/glcanvas_wrap.cpp:2740:15: error: ‘arg1’ was not declared in this scope
contrib/glcanvas/gtk/glcanvas_wrap.cpp:2740:35: error: expected primary-expression before ‘)’ token
contrib/glcanvas/gtk/glcanvas_wrap.cpp:2740:37: error: expected ‘;’ before numeric constant
contrib/glcanvas/gtk/glcanvas_wrap.cpp:2741:3: error: ‘wxGLContext’ was not declared in this scope
contrib/glcanvas/gtk/glcanvas_wrap.cpp:2741:16: error: ‘arg2’ was not declared in this scope
contrib/glcanvas/gtk/glcanvas_wrap.cpp:2741:37: error: expected primary-expression before ‘)’ token
contrib/glcanvas/gtk/glcanvas_wrap.cpp:2741:39: error: expected ‘;’ before ‘__null’
contrib/glcanvas/gtk/glcanvas_wrap.cpp:2742:16: error: ‘result’ was not declared in this scope
contrib/glcanvas/gtk/glcanvas_wrap.cpp:2758:28: error: expected type-specifier before ‘wxGLCanvas’
contrib/glcanvas/gtk/glcanvas_wrap.cpp:2758:28: error: expected ‘>’ before ‘wxGLCanvas’
contrib/glcanvas/gtk/glcanvas_wrap.cpp:2758:28: error: expected ‘(’ before ‘wxGLCanvas’
contrib/glcanvas/gtk/glcanvas_wrap.cpp:2758:41: error: expected primary-expression before ‘>’ token
contrib/glcanvas/gtk/glcanvas_wrap.cpp:2758:49: error: expected ‘)’ before ‘;’ token
contrib/glcanvas/gtk/glcanvas_wrap.cpp:2764:30: error: expected type-specifier before ‘wxGLContext’
contrib/glcanvas/gtk/glcanvas_wrap.cpp:2764:30: error: expected ‘>’ before ‘wxGLContext’
contrib/glcanvas/gtk/glcanvas_wrap.cpp:2764:30: error: expected ‘(’ before ‘wxGLContext’
contrib/glcanvas/gtk/glcanvas_wrap.cpp:2764:44: error: expected primary-expression before ‘>’ token
contrib/glcanvas/gtk/glcanvas_wrap.cpp:2764:52: error: expected ‘)’ before ‘;’ token
contrib/glcanvas/gtk/glcanvas_wrap.cpp:2769:28: error: expected primary-expression before ‘)’ token
contrib/glcanvas/gtk/glcanvas_wrap.cpp:2769:29: error: expected ‘;’ before ‘new’
contrib/glcanvas/gtk/glcanvas_wrap.cpp: In function ‘PyObject* _wrap_delete_GLContext(PyObject*, PyObject*)’:
contrib/glcanvas/gtk/glcanvas_wrap.cpp:2782:3: error: ‘wxGLContext’ was not declared in this scope
contrib/glcanvas/gtk/glcanvas_wrap.cpp:2782:16: error: ‘arg1’ was not declared in this scope
contrib/glcanvas/gtk/glcanvas_wrap.cpp:2782:37: error: expected primary-expression before ‘)’ token
contrib/glcanvas/gtk/glcanvas_wrap.cpp:2782:39: error: expected ‘;’ before numeric constant
contrib/glcanvas/gtk/glcanvas_wrap.cpp:2793:28: error: expected type-specifier before ‘wxGLContext’
contrib/glcanvas/gtk/glcanvas_wrap.cpp:2793:28: error: expected ‘>’ before ‘wxGLContext’
contrib/glcanvas/gtk/glcanvas_wrap.cpp:2793:28: error: expected ‘(’ before ‘wxGLContext’
contrib/glcanvas/gtk/glcanvas_wrap.cpp:2793:42: error: expected primary-expression before ‘>’ token
contrib/glcanvas/gtk/glcanvas_wrap.cpp:2793:50: error: expected ‘)’ before ‘;’ token
contrib/glcanvas/gtk/glcanvas_wrap.cpp:2796:12: error: type ‘<type error>’ argument given to ‘delete’, expected pointer
contrib/glcanvas/gtk/glcanvas_wrap.cpp: In function ‘PyObject* _wrap_GLContext_SetCurrent(PyObject*, PyObject*, PyObject*)’:
contrib/glcanvas/gtk/glcanvas_wrap.cpp:2810:3: error: ‘wxGLContext’ was not declared in this scope
contrib/glcanvas/gtk/glcanvas_wrap.cpp:2810:16: error: ‘arg1’ was not declared in this scope
contrib/glcanvas/gtk/glcanvas_wrap.cpp:2810:37: error: expected primary-expression before ‘)’ token
contrib/glcanvas/gtk/glcanvas_wrap.cpp:2810:39: error: expected ‘;’ before numeric constant
contrib/glcanvas/gtk/glcanvas_wrap.cpp:2811:3: error: ‘wxGLCanvas’ was not declared in this scope
contrib/glcanvas/gtk/glcanvas_wrap.cpp:2811:15: error: ‘arg2’ was not declared in this scope
contrib/glcanvas/gtk/glcanvas_wrap.cpp:2827:28: error: expected type-specifier before ‘wxGLContext’
contrib/glcanvas/gtk/glcanvas_wrap.cpp:2827:28: error: expected ‘>’ before ‘wxGLContext’
contrib/glcanvas/gtk/glcanvas_wrap.cpp:2827:28: error: expected ‘(’ before ‘wxGLContext’
contrib/glcanvas/gtk/glcanvas_wrap.cpp:2827:42: error: expected primary-expression before ‘>’ token
contrib/glcanvas/gtk/glcanvas_wrap.cpp:2827:50: error: expected ‘)’ before ‘;’ token
contrib/glcanvas/gtk/glcanvas_wrap.cpp:2835:28: error: expected type-specifier before ‘wxGLCanvas’
contrib/glcanvas/gtk/glcanvas_wrap.cpp:2835:28: error: expected ‘>’ before ‘wxGLCanvas’
contrib/glcanvas/gtk/glcanvas_wrap.cpp:2835:28: error: expected ‘(’ before ‘wxGLCanvas’
contrib/glcanvas/gtk/glcanvas_wrap.cpp:2835:41: error: expected primary-expression before ‘>’ token
contrib/glcanvas/gtk/glcanvas_wrap.cpp:2835:49: error: expected ‘)’ before ‘;’ token
contrib/glcanvas/gtk/glcanvas_wrap.cpp:2838:36: error: expected ‘)’ before ‘const’
contrib/glcanvas/gtk/glcanvas_wrap.cpp:2838:50: error: expected ‘)’ before ‘;’ token
contrib/glcanvas/gtk/glcanvas_wrap.cpp: In function ‘PyObject* _wrap_new_GLCanvas(PyObject*, PyObject*, PyObject*)’:
contrib/glcanvas/gtk/glcanvas_wrap.cpp:2874:3: error: ‘wxGLCanvas’ was not declared in this scope
contrib/glcanvas/gtk/glcanvas_wrap.cpp:2874:15: error: ‘result’ was not declared in this scope
contrib/glcanvas/gtk/glcanvas_wrap.cpp:2965:27: error: expected primary-expression before ‘)’ token
contrib/glcanvas/gtk/glcanvas_wrap.cpp:2965:28: error: expected ‘;’ before ‘new’
contrib/glcanvas/gtk/glcanvas_wrap.cpp: In function ‘PyObject* _wrap_new_GLCanvasWithContext(PyObject*, PyObject*, PyObject*)’:
contrib/glcanvas/gtk/glcanvas_wrap.cpp:2993:3: error: ‘wxGLContext’ was not declared in this scope
contrib/glcanvas/gtk/glcanvas_wrap.cpp:2993:16: error: ‘arg2’ was not declared in this scope
contrib/glcanvas/gtk/glcanvas_wrap.cpp:2993:37: error: expected primary-expression before ‘)’ token
contrib/glcanvas/gtk/glcanvas_wrap.cpp:2993:39: error: expected ‘;’ before ‘__null’
contrib/glcanvas/gtk/glcanvas_wrap.cpp:3005:3: error: ‘wxGLCanvas’ was not declared in this scope
contrib/glcanvas/gtk/glcanvas_wrap.cpp:3005:15: error: ‘result’ was not declared in this scope
contrib/glcanvas/gtk/glcanvas_wrap.cpp:3044:30: error: expected type-specifier before ‘wxGLContext’
contrib/glcanvas/gtk/glcanvas_wrap.cpp:3044:30: error: expected ‘>’ before ‘wxGLContext’
contrib/glcanvas/gtk/glcanvas_wrap.cpp:3044:30: error: expected ‘(’ before ‘wxGLContext’
contrib/glcanvas/gtk/glcanvas_wrap.cpp:3044:44: error: expected primary-expression before ‘>’ token
contrib/glcanvas/gtk/glcanvas_wrap.cpp:3044:52: error: expected ‘)’ before ‘;’ token
contrib/glcanvas/gtk/glcanvas_wrap.cpp:3106:27: error: expected primary-expression before ‘)’ token
contrib/glcanvas/gtk/glcanvas_wrap.cpp:3106:28: error: expected ‘;’ before ‘new’
contrib/glcanvas/gtk/glcanvas_wrap.cpp: In function ‘PyObject* _wrap_GLCanvas_SetCurrent__SWIG_0(PyObject*, int, PyObject**)’:
contrib/glcanvas/gtk/glcanvas_wrap.cpp:3133:3: error: ‘wxGLCanvas’ was not declared in this scope
contrib/glcanvas/gtk/glcanvas_wrap.cpp:3133:15: error: ‘arg1’ was not declared in this scope
contrib/glcanvas/gtk/glcanvas_wrap.cpp:3133:35: error: expected primary-expression before ‘)’ token
contrib/glcanvas/gtk/glcanvas_wrap.cpp:3133:37: error: expected ‘;’ before numeric constant
contrib/glcanvas/gtk/glcanvas_wrap.cpp:3142:28: error: expected type-specifier before ‘wxGLCanvas’
contrib/glcanvas/gtk/glcanvas_wrap.cpp:3142:28: error: expected ‘>’ before ‘wxGLCanvas’
contrib/glcanvas/gtk/glcanvas_wrap.cpp:3142:28: error: expected ‘(’ before ‘wxGLCanvas’
contrib/glcanvas/gtk/glcanvas_wrap.cpp:3142:41: error: expected primary-expression before ‘>’ token
contrib/glcanvas/gtk/glcanvas_wrap.cpp:3142:49: error: expected ‘)’ before ‘;’ token
contrib/glcanvas/gtk/glcanvas_wrap.cpp: In function ‘PyObject* _wrap_GLCanvas_SetCurrent__SWIG_1(PyObject*, int, PyObject**)’:
contrib/glcanvas/gtk/glcanvas_wrap.cpp:3158:3: error: ‘wxGLCanvas’ was not declared in this scope
contrib/glcanvas/gtk/glcanvas_wrap.cpp:3158:15: error: ‘arg1’ was not declared in this scope
contrib/glcanvas/gtk/glcanvas_wrap.cpp:3158:35: error: expected primary-expression before ‘)’ token
contrib/glcanvas/gtk/glcanvas_wrap.cpp:3158:37: error: expected ‘;’ before numeric constant
contrib/glcanvas/gtk/glcanvas_wrap.cpp:3159:3: error: ‘wxGLContext’ was not declared in this scope
contrib/glcanvas/gtk/glcanvas_wrap.cpp:3159:16: error: ‘arg2’ was not declared in this scope
contrib/glcanvas/gtk/glcanvas_wrap.cpp:3170:28: error: expected type-specifier before ‘wxGLCanvas’
contrib/glcanvas/gtk/glcanvas_wrap.cpp:3170:28: error: expected ‘>’ before ‘wxGLCanvas’
contrib/glcanvas/gtk/glcanvas_wrap.cpp:3170:28: error: expected ‘(’ before ‘wxGLCanvas’
contrib/glcanvas/gtk/glcanvas_wrap.cpp:3170:41: error: expected primary-expression before ‘>’ token
contrib/glcanvas/gtk/glcanvas_wrap.cpp:3170:49: error: expected ‘)’ before ‘;’ token
contrib/glcanvas/gtk/glcanvas_wrap.cpp:3178:28: error: expected type-specifier before ‘wxGLContext’
contrib/glcanvas/gtk/glcanvas_wrap.cpp:3178:28: error: expected ‘>’ before ‘wxGLContext’
contrib/glcanvas/gtk/glcanvas_wrap.cpp:3178:28: error: expected ‘(’ before ‘wxGLContext’
contrib/glcanvas/gtk/glcanvas_wrap.cpp:3178:42: error: expected primary-expression before ‘>’ token
contrib/glcanvas/gtk/glcanvas_wrap.cpp:3178:50: error: expected ‘)’ before ‘;’ token
contrib/glcanvas/gtk/glcanvas_wrap.cpp:3181:37: error: expected ‘)’ before ‘const’
contrib/glcanvas/gtk/glcanvas_wrap.cpp:3181:51: error: expected ‘)’ before ‘;’ token
contrib/glcanvas/gtk/glcanvas_wrap.cpp: In function ‘PyObject* _wrap_GLCanvas_SetColour(PyObject*, PyObject*, PyObject*)’:
contrib/glcanvas/gtk/glcanvas_wrap.cpp:3213:3: error: ‘wxGLCanvas’ was not declared in this scope
contrib/glcanvas/gtk/glcanvas_wrap.cpp:3213:15: error: ‘arg1’ was not declared in this scope
contrib/glcanvas/gtk/glcanvas_wrap.cpp:3213:35: error: expected primary-expression before ‘)’ token
contrib/glcanvas/gtk/glcanvas_wrap.cpp:3213:37: error: expected ‘;’ before numeric constant
contrib/glcanvas/gtk/glcanvas_wrap.cpp:3229:28: error: expected type-specifier before ‘wxGLCanvas’
contrib/glcanvas/gtk/glcanvas_wrap.cpp:3229:28: error: expected ‘>’ before ‘wxGLCanvas’
contrib/glcanvas/gtk/glcanvas_wrap.cpp:3229:28: error: expected ‘(’ before ‘wxGLCanvas’
contrib/glcanvas/gtk/glcanvas_wrap.cpp:3229:41: error: expected primary-expression before ‘>’ token
contrib/glcanvas/gtk/glcanvas_wrap.cpp:3229:49: error: expected ‘)’ before ‘;’ token
contrib/glcanvas/gtk/glcanvas_wrap.cpp: In function ‘PyObject* _wrap_GLCanvas_SwapBuffers(PyObject*, PyObject*)’:
contrib/glcanvas/gtk/glcanvas_wrap.cpp:3258:3: error: ‘wxGLCanvas’ was not declared in this scope
contrib/glcanvas/gtk/glcanvas_wrap.cpp:3258:15: error: ‘arg1’ was not declared in this scope
contrib/glcanvas/gtk/glcanvas_wrap.cpp:3258:35: error: expected primary-expression before ‘)’ token
contrib/glcanvas/gtk/glcanvas_wrap.cpp:3258:37: error: expected ‘;’ before numeric constant
contrib/glcanvas/gtk/glcanvas_wrap.cpp:3269:28: error: expected type-specifier before ‘wxGLCanvas’
contrib/glcanvas/gtk/glcanvas_wrap.cpp:3269:28: error: expected ‘>’ before ‘wxGLCanvas’
contrib/glcanvas/gtk/glcanvas_wrap.cpp:3269:28: error: expected ‘(’ before ‘wxGLCanvas’
contrib/glcanvas/gtk/glcanvas_wrap.cpp:3269:41: error: expected primary-expression before ‘>’ token
contrib/glcanvas/gtk/glcanvas_wrap.cpp:3269:49: error: expected ‘)’ before ‘;’ token
contrib/glcanvas/gtk/glcanvas_wrap.cpp: In function ‘PyObject* _wrap_GLCanvas_GetContext(PyObject*, PyObject*)’:
contrib/glcanvas/gtk/glcanvas_wrap.cpp:3285:3: error: ‘wxGLCanvas’ was not declared in this scope
contrib/glcanvas/gtk/glcanvas_wrap.cpp:3285:15: error: ‘arg1’ was not declared in this scope
contrib/glcanvas/gtk/glcanvas_wrap.cpp:3285:35: error: expected primary-expression before ‘)’ token
contrib/glcanvas/gtk/glcanvas_wrap.cpp:3285:37: error: expected ‘;’ before numeric constant
contrib/glcanvas/gtk/glcanvas_wrap.cpp:3286:3: error: ‘wxGLContext’ was not declared in this scope
contrib/glcanvas/gtk/glcanvas_wrap.cpp:3286:16: error: ‘result’ was not declared in this scope
contrib/glcanvas/gtk/glcanvas_wrap.cpp:3297:28: error: expected type-specifier before ‘wxGLCanvas’
contrib/glcanvas/gtk/glcanvas_wrap.cpp:3297:28: error: expected ‘>’ before ‘wxGLCanvas’
contrib/glcanvas/gtk/glcanvas_wrap.cpp:3297:28: error: expected ‘(’ before ‘wxGLCanvas’
contrib/glcanvas/gtk/glcanvas_wrap.cpp:3297:41: error: expected primary-expression before ‘>’ token
contrib/glcanvas/gtk/glcanvas_wrap.cpp:3297:49: error: expected ‘)’ before ‘;’ token
contrib/glcanvas/gtk/glcanvas_wrap.cpp:3300:28: error: expected primary-expression before ‘)’ token
contrib/glcanvas/gtk/glcanvas_wrap.cpp: In function ‘void* _p_wxGLContextTo_p_wxObject(void*)’:
contrib/glcanvas/gtk/glcanvas_wrap.cpp:3424:37: error: ‘wxGLContext’ was not declared in this scope
contrib/glcanvas/gtk/glcanvas_wrap.cpp:3424:50: error: expected primary-expression before ‘)’ token
contrib/glcanvas/gtk/glcanvas_wrap.cpp:3424:52: error: expected ‘)’ before ‘x’
contrib/glcanvas/gtk/glcanvas_wrap.cpp:3424:55: error: expected ‘)’ before ‘;’ token
contrib/glcanvas/gtk/glcanvas_wrap.cpp: In function ‘void* _p_wxGLCanvasTo_p_wxObject(void*)’:
contrib/glcanvas/gtk/glcanvas_wrap.cpp:3511:65: error: ‘wxGLCanvas’ was not declared in this scope
contrib/glcanvas/gtk/glcanvas_wrap.cpp:3511:77: error: expected primary-expression before ‘)’ token
contrib/glcanvas/gtk/glcanvas_wrap.cpp:3511:79: error: expected ‘)’ before ‘x’
contrib/glcanvas/gtk/glcanvas_wrap.cpp:3511:82: error: expected ‘)’ before ‘;’ token
contrib/glcanvas/gtk/glcanvas_wrap.cpp: In function ‘void* _p_wxGLCanvasTo_p_wxWindow(void*)’:
contrib/glcanvas/gtk/glcanvas_wrap.cpp:3598:37: error: ‘wxGLCanvas’ was not declared in this scope
contrib/glcanvas/gtk/glcanvas_wrap.cpp:3598:49: error: expected primary-expression before ‘)’ token
contrib/glcanvas/gtk/glcanvas_wrap.cpp:3598:51: error: expected ‘)’ before ‘x’
contrib/glcanvas/gtk/glcanvas_wrap.cpp:3598:54: error: expected ‘)’ before ‘;’ token
contrib/glcanvas/gtk/glcanvas_wrap.cpp: In function ‘void* _p_wxGLCanvasTo_p_wxEvtHandler(void*)’:
contrib/glcanvas/gtk/glcanvas_wrap.cpp:3625:53: error: ‘wxGLCanvas’ was not declared in this scope
contrib/glcanvas/gtk/glcanvas_wrap.cpp:3625:65: error: expected primary-expression before ‘)’ token
contrib/glcanvas/gtk/glcanvas_wrap.cpp:3625:67: error: expected ‘)’ before ‘x’
contrib/glcanvas/gtk/glcanvas_wrap.cpp:3625:70: error: expected ‘)’ before ‘;’ token
contrib/glcanvas/gtk/glcanvas_wrap.cpp: In function ‘void init_glcanvas()’:
contrib/glcanvas/gtk/glcanvas_wrap.cpp:4513:76: error: ‘WX_GL_RGBA’ was not declared in this scope
contrib/glcanvas/gtk/glcanvas_wrap.cpp:4514:83: error: ‘WX_GL_BUFFER_SIZE’ was not declared in this scope
contrib/glcanvas/gtk/glcanvas_wrap.cpp:4515:77: error: ‘WX_GL_LEVEL’ was not declared in this scope
contrib/glcanvas/gtk/glcanvas_wrap.cpp:4516:84: error: ‘WX_GL_DOUBLEBUFFER’ was not declared in this scope
contrib/glcanvas/gtk/glcanvas_wrap.cpp:4517:78: error: ‘WX_GL_STEREO’ was not declared in this scope
contrib/glcanvas/gtk/glcanvas_wrap.cpp:4518:83: error: ‘WX_GL_AUX_BUFFERS’ was not declared in this scope
contrib/glcanvas/gtk/glcanvas_wrap.cpp:4519:79: error: ‘WX_GL_MIN_RED’ was not declared in this scope
contrib/glcanvas/gtk/glcanvas_wrap.cpp:4520:81: error: ‘WX_GL_MIN_GREEN’ was not declared in this scope
contrib/glcanvas/gtk/glcanvas_wrap.cpp:4521:80: error: ‘WX_GL_MIN_BLUE’ was not declared in this scope
contrib/glcanvas/gtk/glcanvas_wrap.cpp:4522:81: error: ‘WX_GL_MIN_ALPHA’ was not declared in this scope
contrib/glcanvas/gtk/glcanvas_wrap.cpp:4523:82: error: ‘WX_GL_DEPTH_SIZE’ was not declared in this scope
contrib/glcanvas/gtk/glcanvas_wrap.cpp:4524:84: error: ‘WX_GL_STENCIL_SIZE’ was not declared in this scope
contrib/glcanvas/gtk/glcanvas_wrap.cpp:4525:85: error: ‘WX_GL_MIN_ACCUM_RED’ was not declared in this scope
contrib/glcanvas/gtk/glcanvas_wrap.cpp:4526:87: error: ‘WX_GL_MIN_ACCUM_GREEN’ was not declared in this scope
contrib/glcanvas/gtk/glcanvas_wrap.cpp:4527:86: error: ‘WX_GL_MIN_ACCUM_BLUE’ was not declared in this scope
contrib/glcanvas/gtk/glcanvas_wrap.cpp:4528:87: error: ‘WX_GL_MIN_ACCUM_ALPHA’ was not declared in this scope
error: command 'gcc' failed with exit status 1
==> ERRORE: Si è verificato un errore in build().
    L'operazione sta per essere interrotta...
The build failed.
Sembra tanto uno di quegli errori di quando si dimentica d'includere una libreria... Voi che dite?

 

Template by Homey | Sito ufficiale | Disclaimer